{"text_format":"1","workbook":"xlsx","n_sheets":18,"sheets":["Recap","Equip","Fixt","Other","Rental","Subs","Labor","Info","PipeSummary","PipeDetail","PipeEquipment","PipeFixtures","PipeSpecialties","PipeOther","PipeExceptions","Extra","PipeData","Config"],"not_rendered":{"charts":0,"images":4,"macros":1,"external_links":1,"defined_names":57,"comments":0,"pivot_tables":0},"unopened":[],"bounds":{"document_bytes":16777216,"sheet_cells":100000,"rows_first":2000,"rows_last":500,"rows_between":2000,"halvings":0,"cell_chars":16384,"cell_head_chars":4096},"cells_cut":0,"cells_raw":0,"read":"whole","date_system":"1900"}

{"sheet":"Recap","index":0,"n_rows":49,"n_cols":6,"rows_kept":49,"cut":false,"hidden":false,"merged":[[44,0,44,2],[47,0,47,4],[9,2,9,3],[10,2,10,3],[11,2,11,3],[12,2,12,3],[41,0,41,2]]}
["BID RECAP SHEET"]
[null,null,null,null,"Date:"]
["Company:",{"$f":"CompanyName","v":"Comfort Systems USA Arkansas"}]
["JobName:",{"$f":"JobName","v":"MERCY 7TH FLOOR"}]
["Bid:","Base Bid"]
["Location:",{"$f":"JobSiteCity","v":0},{"$f":"JobSiteState","v":0}]
[null,null,"Labor"]
[null,"Materials","Hours","Rate","Labor $","Total"]
["Summary",{"$f":"PipeSummaryMatl","v":646413.71561257262},{"$f":"PipeSummaryHours","v":8758.6658997535651},{"$f":"Labor!K17","v":35},{"$f":"D9*C9","v":306553.30649137479},{"$f":"E9+B9","v":952967.02210394735}]
["Pipe Equipment Total",{"$f":"PipeEquipmentMatl","v":0},"w/Summary",null,0,{"$f":"E10+B10","v":0}]
{"$rows_left_out":40}
{"sheet":"Equip","index":1,"n_rows":50,"n_cols":30,"rows_kept":50,"cut":false,"hidden":false,"merged":[[5,28,5,29],[5,18,5,19],[5,20,5,21],[5,22,5,23],[5,24,5,25],[5,26,5,27],[5,3,5,4],[2,1,2,11],[3,1,3,11],[5,14,5,15],[5,16,5,17]]}
["HVAC EQUIPMENT"]
[]
["Company:",{"$f":"CompanyName","v":"Comfort Systems USA Arkansas"}]
["JobName:",{"$f":"JobPath","v":"S:\\FastEST\\FastEST-Local.site\\Jobs\\MERCY 7TH FLOOR.job"}]
[]
[null,null,null,"Materials",null,"Sheet Metal Materials",null,"Labor Hours",null,"SM Shop Hours",null,"SM Field Hours",null,null,"Trane",null,"Airetech",null,"Carrier",null,"York",null,"Jaco",null,"Fluid Solutions"]
["Mark","Description","Quantity","Unit","Total","Unit","Total","Unit","Total","Unit","Total","Unit","Total",null,"Each","Total","Each","Total","Each","Total","Each","Total","Each","Total","Each","Total","Each","Total","Each","Total"]
[null,"VAVs",59,null,{"$f":"D8*C8","v":0},null,{"$f":"F8*C8","v":0},3,{"$f":"H8*C8","v":177},null,{"$f":"J8*C8","v":0},null,{"$f":"L8*C8","v":0},null,null,{"$f":"SUM(C8*O8)","v":0},null,{"$f":"SUM(C8*Q8)","v":0},null,{"$f":"SUM(C8*S8)","v":0},null,{"$f":"SUM(C8*U8)","v":0},null,{"$f":"SUM(C8*W8)","v":0},null,{"$f":"SUM(C8*Y8)","v":0},null,{"$f":"SUM(C8*AA8)","v":0},null,{"$f":"SUM(C8*AC8)","v":0}]
[null,"Exhaust Fans",4,null,{"$f":"D9*C9","v":0},null,{"$f":"F9*C9","v":0},3,{"$f":"H9*C9","v":12},null,{"$f":"J9*C9","v":0},null,{"$f":"L9*C9","v":0},null,null,{"$f":"SUM(C9*O9)","v":0},null,{"$f":"SUM(C9*Q9)","v":0},null,{"$f":"SUM(C9*S9)","v":0},null,{"$f":"SUM(C9*U9)","v":0},null,{"$f":"SUM(C9*W9)","v":0},null,{"$f":"SUM(C9*Y9)","v":0},null,{"$f":"SUM(C9*AA9)","v":0},null,{"$f":"SUM(C9*AC9)","v":0}]
[null,"Airetech",1,27870,27870,null,0,null,0,null,0,null,0,null,null,{"$f":"SUM(C10*O10)","v":0},null,{"$f":"SUM(C10*Q10)","v":0},null,{"$f":"SUM(C10*S10)","v":0},null,{"$f":"SUM(C10*U10)","v":0},null,{"$f":"SUM(C10*W10)","v":0},null,{"$f":"SUM(C10*Y10)","v":0},null,{"$f":"SUM(C10*AA10)","v":0},null,{"$f":"SUM(C10*AC10)","v":0}]
{"$rows_left_out":41}
{"sheet":"Fixt","index":2,"n_rows":26,"n_cols":16,"rows_kept":26,"cut":false,"hidden":false,"merged":[[5,14,5,15],[2,1,2,11],[3,1,3,11],[5,8,5,9],[5,10,5,11],[5,12,5,13]]}
["FIXTURE"]
[]
["Company:",{"$f":"CompanyName","v":"Comfort Systems USA Arkansas"}]
["JobName:",{"$f":"JobPath","v":"S:\\FastEST\\FastEST-Local.site\\Jobs\\MERCY 7TH FLOOR.job"}]
[]
[null,null,null,"Materials",null,"Labor Hours",null,null,"SPWN",null,"Ferguson",null,"Star",null,"Sanders"]
["Mark","Description","Quantity","Unit","Total","Unit","Total",null,"Each","Total","Each","Total","Each","Total","Each","Total"]
["DB1",null,30,34,{"$f":"D8*C8","v":1020},2,{"$f":"F8*C8","v":60},null,null,{"$f":"SUM(C8*I8)","v":0},null,{"$f":"SUM(C8*K8)","v":0},null,{"$f":"SUM(C8*M8)","v":0},null,{"$f":"SUM(C8*O8)","v":0}]
["DF1",null,1,1260,1260,4,4,null,null,0,null,0,null,0,null,0]
["EE1",null,3,1100,3300,2,6,null,null,0,null,0,null,0,null,0]
{"$rows_left_out":17}
{"sheet":"Other","index":3,"n_rows":59,"n_cols":13,"rows_kept":59,"cut":false,"hidden":false,"merged":[[2,1,2,11],[3,1,3,11]]}
["OTHER JOB COSTS"]
[]
["Company:",{"$f":"CompanyName","v":"Comfort Systems USA Arkansas"}]
["JobName:",{"$f":"JobPath","v":"S:\\FastEST\\FastEST-Local.site\\Jobs\\MERCY 7TH FLOOR.job"}]
[]
[]
[null,null,"Materials",null,"Labor Hours"]
[null,"Description","Total","Sheet Metal","Hours","Rate","Total","Shop Hrs","Rate","Total","Field Hrs","Rate","Total"]
[1,"Small Tools (5% of Labor)",{"$f":"SUM(Recap!E20*0.06)","v":26788.998389482487},null,0,0,{"$f":"IF(E9>0,IF(F9=0,\"No Rate\",E9*F9),0)","v":0},null,null,{"$f":"IF(H9>0,IF(I9=0,\"No Rate\",H9*I9),0)","v":0},null,null,{"$f":"IF(K9>0,IF(L9=0,\"No Rate\",K9*L9),0)","v":0}]
[2,null,null,null,null,null,{"$f":"IF(E10>0,IF(F10=0,\"No Rate\",E10*F10),0)","v":0},null,null,{"$f":"IF(H10>0,IF(I10=0,\"No Rate\",H10*I10),0)","v":0},null,null,{"$f":"IF(K10>0,IF(L10=0,\"No Rate\",K10*L10),0)","v":0}]
{"$rows_left_out":50}
{"sheet":"Rental","index":4,"n_rows":52,"n_cols":9,"rows_kept":52,"cut":false,"hidden":false,"merged":[[7,2,7,3],[7,4,7,5],[7,6,7,7],[2,1,2,11],[3,1,3,11]]}
["EQUIPMENT RENTAL"]
[]
["Company:",{"$f":"CompanyName","v":"Comfort Systems USA Arkansas"}]
["JobName:",{"$f":"JobPath","v":"S:\\FastEST\\FastEST-Local.site\\Jobs\\MERCY 7TH FLOOR.job"}]
[]
[]
[null,null,"Rental Rates"]
[null,null,"Daily",null,"Weekly",null,"Monthly"]
[null,"Description","Days","Rate","Weeks","Rate","Months","Rate","Total"]
[1,"Automobile",null,0,null,0,null,5,{"$f":"(C10*D10)+(E10*F10)+(G10*H10)","v":0}]
{"$rows_left_out":43}
{"sheet":"Subs","index":5,"n_rows":48,"n_cols":15,"rows_kept":48,"cut":false,"hidden":false,"merged":[[5,13,5,14],[2,1,2,11],[3,1,3,11],[5,5,5,6],[5,7,5,8],[5,9,5,10],[5,11,5,12]]}
["SUBCONTRACTORS"]
[null,{"$f":"IF(Info!F11=\"Y\",\"NOT including Sales Tax\",IF(Info!F12=\"Y\",\"NOT including Sales Tax\",\"including Sales Tax\"))","v":"including Sales Tax"}]
["Company:",{"$f":"CompanyName","v":"Comfort Systems USA Arkansas"}]
["JobName:",{"$f":"JobPath","v":"S:\\FastEST\\FastEST-Local.site\\Jobs\\MERCY 7TH FLOOR.job"}]
[]
[null,null,null,null,null,"Sheet Metal",null,"Insulation",null,"Controls",null,"Chemical Treatment",null,"Electrical"]
[null,"Description","Vendor","Price",null,"Vendor","Price","Vendor","Price","Vendor","Price","Vendor","Price","Vendor","Price"]
[1,"Sheet Metal","Knight Wilson",420000]
[2,"Insulation","Midwest",90814]
[3,"Temperature Controls","Airetech",166000]
{"$rows_left_out":39}
{"sheet":"Labor","index":6,"n_rows":30,"n_cols":12,"rows_kept":30,"cut":false,"hidden":false,"merged":[[2,1,2,11],[3,1,3,11]]}
["LABOR RATES"]
[]
["Company:",{"$f":"CompanyName","v":"Comfort Systems USA Arkansas"}]
["JobName:",{"$f":"JobPath","v":"S:\\FastEST\\FastEST-Local.site\\Jobs\\MERCY 7TH FLOOR.job"}]
[]
[]
["Sheet Metal Shop",null,"Crew","Rate","Total",null,null,"Plumber/Pipefitter",null,"Crew","Rate","Total"]
["General Foreman",null,0,42.56,{"$f":"D8*C8","v":0},null,null,"General Foreman",null,0,44.31,{"$f":"K8*J8","v":0}]
["Foreman",null,1,39.67,{"$f":"D9*C9","v":39.67},null,null,"Foreman",null,0,41.43,0]
["Journeyman",null,1,36.78,36.78,null,null,"Journeyman",null,1,35,35]
{"$rows_left_out":21}
{"sheet":"Info","index":7,"n_rows":15,"n_cols":8,"rows_kept":15,"cut":false,"hidden":false,"merged":[[2,1,2,11],[3,1,3,11]]}
["JOB INFORMATION"]
[]
["Company:",{"$f":"CompanyName","v":"Comfort Systems USA Arkansas"}]
["JobName:",{"$f":"JobPath","v":"S:\\FastEST\\FastEST-Local.site\\Jobs\\MERCY 7TH FLOOR.job"}]
[]
[]
["Sales Tax (Enter Y in only one)"]
["Is there sales tax on materials?",null,null,null,"(Y or N)","Y","Tax %",9.75]
["Is there sales tax on labor?",null,null,null,"(Y or N)","Y","Tax %",48]
["Is there sales tax on materials & labor?",null,null,null,"(Y or N)","N","Tax %",7.5]
{"$rows_left_out":6}
{"sheet":"PipeSummary","index":8,"n_rows":28,"n_cols":13,"rows_kept":28,"cut":false,"hidden":false,"merged":[[6,7,6,12],[4,2,4,12],[5,2,5,12],[0,2,0,12],[1,2,1,12],[2,2,2,12],[3,2,3,12]]}
[null,"Company:",{"$f":"CompanyName","v":"Comfort Systems USA Arkansas"}]
[null,"JobName:",{"$f":"JobPath","v":"S:\\FastEST\\FastEST-Local.site\\Jobs\\MERCY 7TH FLOOR.job"}]
[null,"Material Set:",{"$f":"PipeCalcMaterialSetName","v":"Factor 1"}]
[null,"Labor Set:",{"$f":"PipeCalcLaborSetName","v":1}]
[null,"Run Date:",{"$f":"PipeCalcDateTime","v":"2025-01-07T10:20:37"}]
[null,"Sort Key:","By Matl Group"]
[null,null,null,null,null,null,null,"* - Group contains items with quoted prices"]
["Matl",null,null,"Last",null,null,"List","Matl","Net","Base","Adj","Job","Job"]
["Group","Matl Group Name","Manufacturer","Update","Qty","Wt","Total","Disc","Total","Hours","Hours","Fact","Total"]
["bline6","Threaded Rod","B-Line","2022-06-15",5436,0,27591.267999999996,0.2,5518.2536,544.52000790834484,544.52000904083297,{"$f":"IF(K10=0,1,M10/K10)","v":1},544.52000904083297]
{"$rows_left_out":19}
{"sheet":"PipeDetail","index":9,"n_rows":109,"n_cols":14,"rows_kept":109,"cut":false,"hidden":false,"merged":[[5,3,5,13],[0,3,0,13],[1,3,1,13],[2,3,2,13],[3,3,3,13],[4,3,4,13]]}
[null,null,"Company:",{"$f":"CompanyName","v":"Comfort Systems USA Arkansas"}]
[null,null,"JobName:",{"$f":"JobPath","v":"S:\\FastEST\\FastEST-Local.site\\Jobs\\MERCY 7TH FLOOR.job"}]
[null,null,"Material Set:",{"$f":"PipeCalcMaterialSetName","v":"Factor 1"}]
[null,null,"Labor Set:",{"$f":"PipeCalcLaborSetName","v":1}]
[null,null,"Run Date:",{"$f":"PipeCalcDateTime","v":"2025-01-07T10:20:37"}]
[null,null,"Sort Key:","By Matl Group"]
[]
["Matl",null,null,null,"Matl",null,"Unit","Matl","Net","Net","Unit","Adj","Job","Job"]
["Group","Qty","Size","Description","Group","Wt","Price","Disc","Price","Total","Hours","Hours","Fact","Total"]
["bline6",2156,"⅜","Plain Threaded Rod","bline6",0,2.1949999999999998,0.2,{"$f":"G10*IF(H10=\"Q\",1,H10)","v":0.439},{"$f":"B10*I10","v":946.48400000000004},{"$f":"L10/B10","v":9.0000004405656697E-2},194.04000949859585,{"$f":"IF(L10=0,1,N10/L10)","v":1},194.04000949859585]
{"$rows_left_out":100}
{"sheet":"PipeEquipment","index":10,"n_rows":10,"n_cols":15,"rows_kept":10,"cut":false,"hidden":false,"merged":[[7,13,7,14],[0,8,0,14],[1,8,1,14],[2,8,2,14],[3,8,3,14],[4,8,4,14],[5,8,5,14],[7,10,7,11]]}
[null,null,null,null,null,null,null,"Company:",{"$f":"CompanyName","v":"Comfort Systems USA Arkansas"}]
[null,null,null,null,null,null,null,"JobName:",{"$f":"JobPath","v":"S:\\FastEST\\FastEST-Local.site\\Jobs\\MERCY 7TH FLOOR.job"}]
[null,null,null,null,null,null,null,"Material Set:",{"$f":"PipeCalcMaterialSetName","v":"Factor 1"}]
[null,null,null,null,null,null,null,"Labor Set:",{"$f":"PipeCalcLaborSetName","v":1}]
[null,null,null,null,null,null,null,"Run Date:",{"$f":"PipeCalcDateTime","v":"2025-01-07T10:20:37"}]
[null,null,null,null,null,null,null,"Expanded View:"]
[]
[" ",null,null,null,null,null,null,null,null,"Matl","Quote Info",null,"Cost","Quoted Costs"]
["Code","S1","S2","S3","S4","Qty","Mark","Size","Description","Group","Source","Date","Code","Unit","Total"]
[null,null,null,null,null,null,null,null,null,null,null,null,null,null,0]
{"$rows_left_out":1}
{"sheet":"PipeFixtures","index":11,"n_rows":10,"n_cols":15,"rows_kept":10,"cut":false,"hidden":false,"merged":[[7,13,7,14],[0,8,0,14],[1,8,1,14],[2,8,2,14],[3,8,3,14],[4,8,4,14],[5,8,5,14],[7,10,7,11]]}
[null,null,null,null,null,null,null,"Company:",{"$f":"CompanyName","v":"Comfort Systems USA Arkansas"}]
[null,null,null,null,null,null,null,"JobName:",{"$f":"JobPath","v":"S:\\FastEST\\FastEST-Local.site\\Jobs\\MERCY 7TH FLOOR.job"}]
[null,null,null,null,null,null,null,"Material Set:",{"$f":"PipeCalcMaterialSetName","v":"Factor 1"}]
[null,null,null,null,null,null,null,"Labor Set:",{"$f":"PipeCalcLaborSetName","v":1}]
[null,null,null,null,null,null,null,"Run Date:",{"$f":"PipeCalcDateTime","v":"2025-01-07T10:20:37"}]
[null,null,null,null,null,null,null,"Expanded View:"]
[]
[" ",null,null,null,null,null,null,null,null,"Matl","Quote Info",null,"Cost","Quoted Costs"]
["Code","S1","S2","S3","S4","Qty","Mark","Size","Description","Group","Source","Date","Code","Unit","Total"]
[null,null,null,null,null,null,null,null,null,null,null,null,null,null,0]
{"$rows_left_out":1}
{"sheet":"PipeSpecialties","index":12,"n_rows":10,"n_cols":15,"rows_kept":10,"cut":false,"hidden":false,"merged":[[7,13,7,14],[0,8,0,14],[1,8,1,14],[2,8,2,14],[3,8,3,14],[4,8,4,14],[5,8,5,14],[7,10,7,11]]}
[null,null,null,null,null,null,null,"Company:",{"$f":"CompanyName","v":"Comfort Systems USA Arkansas"}]
[null,null,null,null,null,null,null,"JobName:",{"$f":"JobPath","v":"S:\\FastEST\\FastEST-Local.site\\Jobs\\MERCY 7TH FLOOR.job"}]
[null,null,null,null,null,null,null,"Material Set:",{"$f":"PipeCalcMaterialSetName","v":"Factor 1"}]
[null,null,null,null,null,null,null,"Labor Set:",{"$f":"PipeCalcLaborSetName","v":1}]
[null,null,null,null,null,null,null,"Run Date:",{"$f":"PipeCalcDateTime","v":"2025-01-07T10:20:37"}]
[null,null,null,null,null,null,null,"Expanded View:"]
[]
[" ",null,null,null,null,null,null,null,null,"Matl","Quote Info",null,"Cost","Quoted Costs"]
["Code","S1","S2","S3","S4","Qty","Mark","Size","Description","Group","Source","Date","Code","Unit","Total"]
[null,null,null,null,null,null,null,null,null,null,null,null,null,null,0]
{"$rows_left_out":1}
{"sheet":"PipeOther","index":13,"n_rows":10,"n_cols":15,"rows_kept":10,"cut":false,"hidden":false,"merged":[[7,13,7,14],[0,8,0,14],[1,8,1,14],[2,8,2,14],[3,8,3,14],[4,8,4,14],[5,8,5,14],[7,10,7,11]]}
[null,null,null,null,null,null,null,"Company:",{"$f":"CompanyName","v":"Comfort Systems USA Arkansas"}]
[null,null,null,null,null,null,null,"JobName:",{"$f":"JobPath","v":"S:\\FastEST\\FastEST-Local.site\\Jobs\\MERCY 7TH FLOOR.job"}]
[null,null,null,null,null,null,null,"Material Set:",{"$f":"PipeCalcMaterialSetName","v":"Factor 1"}]
[null,null,null,null,null,null,null,"Labor Set:",{"$f":"PipeCalcLaborSetName","v":1}]
[null,null,null,null,null,null,null,"Run Date:",{"$f":"PipeCalcDateTime","v":"2025-01-07T10:20:37"}]
[null,null,null,null,null,null,null,"Expanded View:"]
[]
[" ",null,null,null,null,null,null,null,null,"Matl","Quote Info",null,"Cost","Quoted Costs"]
["Code","S1","S2","S3","S4","Qty","Mark","Size","Description","Group","Source","Date","Code","Unit","Total"]
[null,null,null,null,null,null,null,null,null,null,null,null,null,null,0]
{"$rows_left_out":1}
{"sheet":"PipeExceptions","index":14,"n_rows":9,"n_cols":4,"rows_kept":9,"cut":false,"hidden":false,"merged":[]}
[null,null,"Company:",{"$f":"CompanyName","v":"Comfort Systems USA Arkansas"}]
[null,null,"JobName:",{"$f":"JobPath","v":"S:\\FastEST\\FastEST-Local.site\\Jobs\\MERCY 7TH FLOOR.job"}]
[null,null,"Material Set:",{"$f":"PipeCalcMaterialSetName","v":"Factor 1"}]
[null,null,"Labor Set:",{"$f":"PipeCalcLaborSetName","v":1}]
[null,null,"Run Date:",{"$f":"PipeCalcDateTime","v":"2025-01-07T10:20:37"}]
[]
[]
[" "]
["Sect","Qty","Size","Description"]

{"sheet":"Extra","index":15,"n_rows":46,"n_cols":6,"rows_kept":46,"cut":false,"hidden":false,"merged":[[3,2,3,3],[3,4,3,5],[0,0,0,5]]}
["Extra"]
[]
[]
[null,null,"Material",null,"Labor"]
["Description","Quantity","Unit","Total","Unit","Total"]
[null,null,null,{"$f":"SUM(B6*C6)","v":0},null,{"$f":"SUM(B6*E6)","v":0}]
[null,null,null,{"$f":"SUM(B7*C7)","v":0},null,{"$f":"SUM(B7*E7)","v":0}]
[null,null,null,0,null,0]
[null,null,null,0,null,0]
[null,null,null,0,null,0]
{"$rows_left_out":37}
{"sheet":"PipeData","index":16,"n_rows":194,"n_cols":58,"rows_kept":194,"cut":false,"hidden":true,"merged":[]}
[193,"Parent","ExceptionID","SectionID","Multiplier","SpecName","SpecDescription","AreaName","SystemName","Remarks","MaterialGroupCode","MaterialGroupName","MaterialGroupID","Manufacturer","PartNumber","UnitPriceDate","Quantity","Description","TagName","ZoneName","UnitWeight","UnitVolume","UnitSurfaceArea","DiameterInches","FamilyID","CostCode","RFU","RFU","PartSize","PartSize1","PartSize2","PartSize3","PartSize4","PartName","UnitPrice","UnitPriceType","MatlDisc","UnitHours","AdjustedHours","JobFactor","PrimarySortKey","SecondarySortKey","LaborGroupCode","LaborGroupName","LaborGroupID","PlanName","OptionalHeader1","OptionalHeader2","OptionalHeader3","OptionalHeader4","ListPrice","SpecName1","SpecName2","SpecType","PartKey","GroupID","ClassID","TypeID"]
[145,-4,0,4,3,"MEDAIR","Cleaned/Capped Copper Med Air","7th floor","Med Gas","Above","","",-1,"","","12:00:00 AM",24,"Suspended Hanger","<None>","<None>",0,0,0,0,44,"<None>",null,null,"1",64,0,0,0,"Suspended",0,"V",0,0,0,0,74752,99,"","",-1,"Plumbing#0011.pdf",null,null,null,null,0,"MEDAIR","",1,null,0,0,0]
[149,-4,0,4,3,"MEDAIR","Cleaned/Capped Copper Med Air","7th floor","Med Gas","Above","","",-1,"","","12:00:00 AM",24,"Suspended Hanger","<None>","<None>",0,0,0,0,44,"<None>",null,null,"1",64,0,0,0,"Suspended",0,"V",0,0,0,0,74752,99,"","",-1,"Plumbing#0012.pdf",null,null,null,null,0,"MEDAIR","",1,null,0,0,0]
[153,-4,0,4,3,"MEDAIR","Cleaned/Capped Copper Med Air","7th floor","Med Gas","Above","","",-1,"","","12:00:00 AM",33,"Suspended Hanger","<None>","<None>",0,0,0,0,44,"<None>",null,null,"1¼",80,0,0,0,"Suspended",0,"V",0,0,0,0,75776,100,"","",-1,"Plumbing#0011.pdf",null,null,null,null,0,"MEDAIR","",1,null,0,0,0]
[157,-4,0,4,3,"MEDAIR","Cleaned/Capped Copper Med Air","7th floor","Med Gas","Above","","",-1,"","","12:00:00 AM",33,"Suspended Hanger","<None>","<None>",0,0,0,0,44,"<None>",null,null,"1¼",80,0,0,0,"Suspended",0,"V",0,0,0,0,75776,100,"","",-1,"Plumbing#0012.pdf",null,null,null,null,0,"MEDAIR","",1,null,0,0,0]
[161,-4,0,4,3,"MEDAIR","Cleaned/Capped Copper Med Air","7th floor","Med Gas","Above","","",-1,"","","12:00:00 AM",12,"Suspended Hanger","<None>","<None>",0,0,0,0,44,"<None>",null,null,"1½",96,0,0,0,"Suspended",0,"V",0,0,0,0,76800,101,"","",-1,"Plumbing#0011.pdf",null,null,null,null,0,"MEDAIR","",1,null,0,0,0]
[165,-4,0,4,3,"MEDAIR","Cleaned/Capped Copper Med Air","7th floor","Med Gas","Above","","",-1,"","","12:00:00 AM",12,"Suspended Hanger","<None>","<None>",0,0,0,0,44,"<None>",null,null,"1½",96,0,0,0,"Suspended",0,"V",0,0,0,0,76800,101,"","",-1,"Plumbing#0012.pdf",null,null,null,null,0,"MEDAIR","",1,null,0,0,0]
[169,-4,0,4,3,"MEDAIR","Cleaned/Capped Copper Med Air","7th floor","Med Gas","Above","","",-1,"","","12:00:00 AM",102,"Suspended Hanger","<None>","<None>",0,0,0,0,44,"<None>",null,null,"2",128,0,0,0,"Suspended",0,"V",0,0,0,0,77824,102,"","",-1,"Plumbing#0011.pdf",null,null,null,null,0,"MEDAIR","",1,null,0,0,0]
[173,-4,0,4,3,"MEDAIR","Cleaned/Capped Copper Med Air","7th floor","Med Gas","Above","","",-1,"","","12:00:00 AM",102,"Suspended Hanger","<None>","<None>",0,0,0,0,44,"<None>",null,null,"2",128,0,0,0,"Suspended",0,"V",0,0,0,0,77824,102,"","",-1,"Plumbing#0012.pdf",null,null,null,null,0,"MEDAIR","",1,null,0,0,0]
[49,-7,0,3,1,"HWSHWR4","Copper/Welded Heating Water","7th floor","Heating Water","Above","","",-1,"","","12:00:00 AM",197,"Suspended Hanger","<None>","<None>",0,0,0,0,44,"<None>",null,null,"2",128,0,0,0,"Suspended",0,"V",0,0,0,0,78848,102,"","",-1,"Mechanical#0010.pdf",null,null,null,null,0,"HWSHWR4","",1,null,0,0,0]
{"$rows_left_out":185}
{"sheet":"Config","index":17,"n_rows":45,"n_cols":3,"rows_kept":45,"cut":false,"hidden":true,"merged":[]}
["Configuration Name","Value","Notes"]
["CompanyName","Comfort Systems USA Arkansas","Company name"]
["ComputerName","ARK02-58Q0TV3","Computer name"]
[]
["SiteName","FastEST-Local.site","Site name"]
["SitePath","S:\\FastEST\\FastEST-Local.site","Site folder full path name"]
["JobName","MERCY 7TH FLOOR","Job name"]
["JobPath","S:\\FastEST\\FastEST-Local.site\\Jobs\\MERCY 7TH FLOOR.job","Job folder full path name"]
["JobDescription","100%DD Budget","Job description"]
["JobTemplateName","Plumbing/HVAC Piping","Job template used during creation"]
{"$rows_left_out":35}